{"text_format":"1","workbook":"xlsx","n_sheets":20,"sheets":["Instructions","Project Request Form","PIJ-EZ Assessment Form","PIJ Questions & Workflow","Full PIJ","PIJ Financials","Areas of Impact","Deliverables & Milestones","Invite Checklist","Conditions List","Approved Vendors","Section Titles","Popups","Invite Checklist Help Popups","Question Type Decoder","Tracking Data","Agency Names and Info","For ADOA-ASET Use Only","Version Notes","Printable PIJ Version"],"not_rendered":{"charts":0,"images":0,"macros":1,"external_links":0,"defined_names":40,"comments":0,"pivot_tables":0},"unopened":[],"bounds":{"document_bytes":16777216,"sheet_cells":100000,"rows_first":2000,"rows_last":500,"rows_between":2000,"halvings":0,"cell_chars":16384,"cell_head_chars":4096},"cells_cut":0,"cells_raw":0,"read":"whole","date_system":"1900"}

{"sheet":"Instructions","index":0,"n_rows":213,"n_cols":18,"rows_kept":213,"cut":false,"hidden":false,"merged":[[1,17,6,23],[78,17,80,19],[167,3,173,11],[97,3,101,11],[93,3,95,11],[105,3,111,11],[81,3,84,11],[86,3,91,11],[113,3,123,11],[125,3,135,11],[137,3,145,11],[147,3,153,11],[155,3,164,11],[78,2,79,12],[1,1,2,13],[21,3,23,11],[199,3,206,11],[208,3,210,11],[212,3,218,11],[175,3,184,11],[186,3,197,11],[25,3,27,11],[29,3,31,11],[33,3,36,11],[4,2,5,12],[7,3,8,11],[10,3,16,11],[18,2,19,12],[73,3,76,11],[46,2,47,12],[49,3,51,11],[41,3,43,11],[38,3,39,11],[53,3,55,11],[57,3,60,11],[62,3,65,11],[67,3,71,11]]}
[]
[null,"Instructions*",null,null,null,null,null,null,null,null,null,null,null,null,null,null,null,"*  The instructions regarding the PIJ process are written in a general manner for any Agency to follow. If there are specific rules regarding the PIJ process that have been established by your Agency, please follow your own internal processes, prior to setting up the collaborative approval meeting, or submitting a PIJ or PIJ-EZ."]
[]
[]
[null,null,"A. Prior to filling out the Sheet"]
[]
[]
[null,null,null,"Save the file to a location of your choosing. The file must be saved, it cannot be opened and used from an email, or used directly from the website without being saved first."]
[]
[]
{"$rows_left_out":204}
{"sheet":"Project Request Form","index":1,"n_rows":69,"n_cols":8,"rows_kept":69,"cut":false,"hidden":false,"merged":[[22,2,22,8],[23,2,23,8],[25,1,26,9],[10,2,10,8],[1,1,2,9],[4,2,5,8],[7,2,7,8],[8,2,8,8],[9,3,9,5],[21,3,21,5],[11,2,11,8],[13,2,13,8],[14,2,14,8],[15,3,15,5],[16,2,16,8],[17,2,17,8],[18,3,18,5],[19,2,19,6],[19,7,19,8],[20,2,20,6],[20,7,20,8],[27,1,32,9],[34,1,35,9],[65,3,67,7],[68,3,68,7],[43,1,44,9],[45,1,50,9],[53,1,54,9],[55,1,55,9],[59,3,60,7],[62,3,63,7],[36,1,41,9]]}
[]
[null,"Project Request"]
[]
[]
[null,null,"[- Please Enter the Project Title Here -]"]
[]
[]
[null,null,"Agency Requesting The Project:"]
[]
[]
{"$rows_left_out":60}
{"sheet":"PIJ-EZ Assessment Form","index":2,"n_rows":28,"n_cols":18,"rows_kept":28,"cut":false,"hidden":false,"merged":[[21,4,23,11],[25,4,26,11],[27,4,27,11],[0,1,1,13],[3,2,4,12],[6,2,7,12],[6,16,7,21],[0,17,2,21],[3,17,4,21],[5,17,5,21],[17,4,19,11]]}
[null,"PIJ-EZ Assessment Form"]
[]
[]
[null,null,"↓  Below to be filled out by an authorized Agency IT professional or in consultation with ADOA-ASET:  ↓",null,null,null,null,null,null,null,null,null,null,null,null,null,null,"For APF & ITAC please download the older PIJ form Here: "]
[]
[null,null,null,null,null,null,null,null,null,null,null,null,null,null,null,null,null,"https://aset.az.gov/pij-information-and-documentation"]
[null,null,"Does this IT acquisition involve funding from the Automation Projects Fund (APF), or other legislative funding source that requires special attention from JLBC or OSPB?*",null,null,null,null,null,null,null,null,null,null,null,null,null,"*If a funding source has not been identified, select \"No\", however, one will be needed before you can proceed with the acquisition. "]
[]
[]
[]
{"$rows_left_out":19}
{"sheet":"PIJ Questions & Workflow","index":3,"n_rows":97,"n_cols":17,"rows_kept":97,"cut":false,"hidden":true,"merged":[]}
[null,null,null,null,null,null,null,null,""]
[null,null,null,null,null,null,null,null,""]
[null,"Resume Point","Section","Parent or Child","Sub Question Trigger","Type of Question","Question","Answer","Comments","Costs","Estimated Start Date","Estimated Finish Date","Risk (H,M,L)","Popup/Disclaimer Needed and Qualifier (Y)","Popup/Disclaimer Reference (Y,N)","Not Sure Prompt","Count Question"]
[null,null,"Meeting Pre-Work","P",null,"C","Has a Project Request been completed for this PIJ?","Y",null,null,null,null,null,null,null,null,{"$f":"IF(D4 = \"P\",\"X\",IF(E4 =H3,\"X\",\"\"))","v":"X"}]
[null,"X","Meeting Pre-Work","P",null,"F","What is the operational issue or business need that the Agency is trying to solve? (i.e. …current process is manual, which increases resource time/costs to the State/Agency, and leads to errors...)","",null,null,null,null,null,null,null,null,"X"]
[null,null,"Meeting Pre-Work","P",null,"F","How will solving this issue or addressing this need benefit the State or the Agency?",null,null,null,null,null,null,null,null,null,"X"]
[null,null,"Meeting Pre-Work","P",null,"F","Describe the proposed solution to this business need:",null,null,null,null,null,null,null,null,null,"X"]
[null,null,"Meeting Pre-Work","P",null,"C","Has the existing technology environment, into which the proposed solution will be implemented, been documented?",null,null,null,null,null,null,null,null,null,"X"]
[null,null,"Meeting Pre-Work","C","Y","F","Indicate where that documentation can be found, or provide the information under separate cover before the meeting, otherwise describe below:",null,null,null,null,null,null,null,null,null,""]
[null,null,"Meeting Pre-Work","C","N","F","Please describe the existing technology environment into which the proposed solution will be implemented. ",null,null,null,null,null,null,null,null,null,{"$f":"IF(D10 = \"P\",\"X\",IF(E10 =H8,\"X\",\"\"))","v":""}]
{"$rows_left_out":88}
{"sheet":"Full PIJ","index":4,"n_rows":23,"n_cols":13,"rows_kept":23,"cut":false,"hidden":false,"merged":[[1,13,3,14],[16,10,18,17],[20,10,21,17],[22,10,22,17],[9,10,14,17],[5,12,6,15],[7,12,7,15]]}
[]
[]
[]
[]
[]
[null,null,null,null,null,null,null,null,null,null,null,null,"*If the proposed project will utilize APF monies or require ITAC approval please download the older PIJ form Here: "]
[]
[null,null,null,null,null,null,null,null,null,null,null,null,"https://aset.az.gov/pij-information-and-documentation"]
[]
[null,null,null,null,null,null,null,null,null,null,"Proceed to the PIJ Main Menu by clicking the button above and select \"Start\" which will begin the PIJ questions. Upon completion of the Meeting Pre-work section (which is the first section of questions), feel free to answer as many questions within the PIJ as you feel comfortable, and use the button below to send the file to your dedicated ADOA-ASET Strategic Program Manager, or to the ITProjects@azdoa.gov mailbox if unsure."]
{"$rows_left_out":14}
{"sheet":"PIJ Financials","index":5,"n_rows":33,"n_cols":25,"rows_kept":33,"cut":false,"hidden":false,"merged":[[13,13,14,14],[13,15,13,16],[14,15,14,16],[0,1,1,2],[11,0,11,9],[11,14,11,22],[12,13,12,14],[12,15,12,16],[2,7,4,8],[3,14,3,16],[4,14,4,16],[6,14,6,16],[7,14,7,16],[2,14,2,16],[2,18,2,19],[6,18,6,19],[15,13,16,14],[15,15,15,16],[16,15,16,16],[17,13,18,14],[17,15,17,16],[18,15,18,16],[19,13,20,14],[19,15,19,16],[20,15,20,16],[21,13,22,14],[21,15,21,16],[22,15,22,16],[23,13,24,14],[23,15,23,16],[24,15,24,16],[25,13,26,14],[25,15,25,16],[26,15,26,16],[36,8,36,9],[30,8,30,9],[27,13,27,14],[27,15,27,16],[31,8,31,9],[28,13,28,14],[28,15,28,16],[32,8,32,9],[29,15,29,16],[33,8,33,9],[34,8,34,9],[35,8,35,9],[57,8,57,9],[58,8,58,9],[49,8,49,9],[50,8,50,9],[51,8,51,9],[52,8,52,9],[53,8,53,9],[54,8,54,9],[55,8,55,9],[56,8,56,9],[48,8,48,9],[37,8,37,9],[38,8,38,9],[39,8,39,9],[40,8,40,9],[41,8,41,9],[42,8,42,9],[43,8,43,9],[44,8,44,9],[45,8,45,9],[46,8,46,9],[47,8,47,9],[7,18,7,19],[0,24,1,25],[2,24,2,25],[5,14,5,16],[3,18,3,19],[4,18,4,19],[5,18,5,19],[0,14,1,21],[2,20,2,21],[3,20,3,21],[4,20,4,21],[5,20,5,21],[6,20,6,21],[7,20,7,21]]}
[null,"Summary of PIJ Financials",null,null,null,null,null,null,null,null,null,null,null,null,"Summary of Funding Sources",null,null,null,null,null,null,null,null,null,"Total costs available to distribute between funding sources"]
[]
[null,"Total of Development Cost:",{"$f":"IF(K31=W28,W28,\"Please Verify Sheet\")","v":0},null,null,null,null,null,null,null,null,null,null,null,"Fund Type",null,null,"% of Project","$ of Project (Available)",null,"$ of Project (To Be Requested)",null,null,null,{"$f":"IF(C5 = 0,\"\",$C$5-$S$4-$U$4-$S$5-$U$5-$S$6-$U$6-$S$7-$U$7-$S$8-$U$8)","v":""}]
[null,"Total of Operational Cost:",{"$f":"IF(K32=W29,W29,\"Please Verify Sheet\")","v":0},null,null,null,null,null,null,null,null,null,null,null,"Base Budget",null,null,{"$f":"IF(S4+U4 = 0,\"\",(S4+U4)/$C$5)","v":""}]
[null,"Total  Costs:",{"$f":"IF(K33=W30,W30,\"Please Verify Sheet\")","v":0},null,null,null,null,null,null,null,null,null,null,null,"APF",null,null,{"$f":"IF(S5+U5 = 0,\"\",(S5+U5)/$C$5)","v":""}]
[null,null,null,null,null,null,null,null,null,null,null,null,null,null,"Other Appropriated",null,null,{"$f":"IF(S6+U6 = 0,\"\",(S6+U6)/$C$5)","v":""}]
[null,null,null,null,null,null,null,null,null,null,null,null,null,null,"Federal",null,null,{"$f":"IF(S7 + U7 =0,\"\",(S7+U7)/$C$5)","v":""}]
[null,null,null,null,null,null,null,null,null,null,null,null,null,null,"Other Non-Appropriated",null,null,{"$f":"IF(S8 +U8 = 0,\"\",(S8+U8)/$C$5)","v":""}]
[]
[]
{"$rows_left_out":24}
{"sheet":"Areas of Impact","index":6,"n_rows":91,"n_cols":6,"rows_kept":91,"cut":false,"hidden":false,"merged":[[70,7,71,12],[81,7,82,12],[90,7,91,12],[11,7,12,12],[60,7,61,12],[1,1,3,9],[0,13,2,14],[21,7,22,12],[40,7,41,12],[50,7,51,12],[30,7,31,12]]}
[]
[null,"Areas of Impact"]
[]
[]
[null,1,"Application Systems"]
[null,null,null,null,"Application Enhancements"]
[null,null,null,null,"Internal Use Web Application"]
[null,null,null,null,"Mobile Application Development"]
[null,null,null,null,"Arizona Enterprise Solution Platform (AESP) based Application"]
[null,null,null,null,"New Application Development"]
{"$rows_left_out":82}
{"sheet":"Deliverables & Milestones","index":7,"n_rows":6,"n_cols":11,"rows_kept":6,"cut":false,"hidden":true,"merged":[[1,2,3,11],[5,2,6,7],[5,8,6,9],[5,10,6,11],[7,2,8,7],[7,8,8,9],[7,10,8,11],[9,2,10,7],[9,8,10,9],[9,10,10,11],[11,2,12,7],[11,8,12,9],[11,10,12,11],[13,2,14,7],[13,8,14,9],[13,10,14,11],[15,2,16,7],[15,8,16,9],[15,10,16,11],[17,2,18,7],[17,8,18,9],[17,10,18,11],[19,2,20,7],[19,8,20,9],[19,10,20,11],[21,2,22,7],[21,8,22,9],[21,10,22,11],[23,2,24,7],[23,8,24,9],[23,10,24,11],[29,2,30,7],[29,8,30,9],[29,10,30,11],[25,2,26,7],[25,8,26,9],[25,10,26,11],[27,2,28,7],[27,8,28,9],[27,10,28,11]]}
[]
[null,null,"Project Milestones/Deliverables"]
[]
[]
[]
[null,null,"Major Milestones/Deliverables",null,null,null,null,null,"Estimated Start Date",null,"Estimated Finish Date"]

{"sheet":"Invite Checklist","index":8,"n_rows":28,"n_cols":19,"rows_kept":28,"cut":false,"hidden":false,"merged":[[27,17,27,18],[13,12,13,17],[11,1,11,7],[11,8,11,11],[11,12,11,17],[14,8,14,11],[12,8,12,11],[16,1,16,7],[17,1,17,7],[13,1,13,7],[13,8,13,11],[25,1,25,7],[16,8,16,11],[16,12,16,17],[17,8,17,11],[17,12,17,17],[5,1,5,7],[5,8,5,11],[5,12,5,17],[6,8,6,11],[7,8,7,11],[6,12,6,17],[7,12,7,17],[9,1,9,7],[7,1,7,7],[8,1,8,7],[6,1,6,7],[10,8,10,11],[10,1,10,7],[18,8,18,11],[18,12,18,17],[19,8,19,11],[19,12,19,17],[18,1,18,7],[19,1,19,7],[20,1,20,7],[21,1,21,7],[22,1,22,7],[23,1,23,7],[25,8,25,11],[25,12,25,17],[20,8,20,11],[20,12,20,17],[21,8,21,11],[21,12,21,17],[22,8,22,11],[22,12,22,17],[1,1,3,18],[15,1,15,18],[23,8,23,11],[23,12,23,17],[24,8,24,11],[24,12,24,17],[24,1,24,7],[14,1,14,7],[12,1,12,7],[8,12,8,17],[9,12,9,17],[10,12,10,17],[14,12,14,17],[12,12,12,17],[8,8,8,11],[9,8,9,11]]}
[]
[null,"PIJ Review Checklist"]
[]
[]
[]
[null,"Role",null,null,null,null,null,null,"Name",null,null,null,"Email Address",null,null,null,null,null,"Date Reviewed"]
[null,"Agency Project Sponsor*"]
[null,"Agency Chief Information Officer (CIO) (or designee)*"]
[null,"Agency Information Security Officer (ISO) (or designee)*"]
[]
{"$rows_left_out":19}
{"sheet":"Conditions List","index":9,"n_rows":17,"n_cols":4,"rows_kept":17,"cut":false,"hidden":true,"merged":[]}
["PIJ Review Status","Condition","Category","As of Date"]
["PIJ Conditional","The Arizona State Library, Archives and Public Records (ASLAPR) Division of the Secretary of State’s Office is the authority governing all document imaging implementations within the State. The Agency must secure an approval or exemption from ASLAPR prior to commencement of the project.","ASLAPR"]
["PIJ Conditional","Should the final costs exceed the estimated costs by 10% or more, or should there be significant changes to the proposed technology, scope of work or implementation schedule, the Agency must amend the PIJ to reflect the changes and submit it to ADOA-ASET for review and approval prior to further expenditure of funds.","Changes - 10% cost only"]
["PIJ Conditional","Prior to the planned purchase, the Agency will work with ADOA-ASET to determine whether enterprise-level pricing or other alternative options may be available.","Enterprise Pricing","Added 4/16/15"]
["PIJ Conditional","The Agency must ensure that a viable plan exists to transition to another vendor and/or in-house platform in the event the contract with the selected vendor terminates.","Exit Strategy - hosted solution"]
["PIJ Provisional","Should the final cost of the project exceed $1 million, review and approval of the full PIJ by the Information Technology Authorization Committee (ITAC), in Executive Session if applicable, will be required before the project can proceed.","ITAC Approval Required - Pre-PIJ"]
["PIJ Conditional","The Agency shall provide an informational update to the Information Technology Authorization Committee (ITAC) regarding the status of the project on an annual basis, or as otherwise requested.","ITAC - Update"]
["PIJ Conditional","The Agency must establish a policy and mechanism to ensure that a Project Investment Justification (PIJ) is submitted for review and approval prior to any and all expenditures in the amount of $25,000 or more, on IT or telecommunications-related hardware, software, or services, in accordance with A.R.S. 41-3504 and A.R.S. 41-3521.  ","PIJ Statutes - Violations"]
["PIJ Provisional","The Agency may proceed with the assessment phase of this project, not to exceed the cost identified in the Pre-PIJ.  However, the Agency may not award a contract or proceed with further development efforts until a full PIJ reflecting the final costs, scope of work, technology, and implementation schedule for the proposed solution, has been submitted to ADOA-ASET for review and approval.","Pre-PIJ Assessment"]
["PIJ Provisional","While a Request for Proposal (RFP) can be issued for the proposed solution, the Agency may not award a contract or proceed with further development efforts until a full PIJ reflecting the final costs, scope of work, technology, and implementation schedule for the proposed solution has been submitted to ADOA-ASET for review and approval.","Pre-PIJ - RFP"]
{"$rows_left_out":8}
{"sheet":"Approved Vendors","index":10,"n_rows":55,"n_cols":15,"rows_kept":55,"cut":false,"hidden":true,"merged":[[1,1,2,10],[1,12,2,13],[1,14,2,14]]}
[]
[null,"Available Enterprise Standards & Approved Hosted/Cloud Environments",null,null,null,null,null,null,null,null,null,null,"Date Last Updated",null,"2015-12-31"]
[]
[null,null,"Standards:",null,null,null,null,"Security Approved Vendors:","Dated Approved"]
[null,null,"Core Networking","HP",null,null,null,"CA","2015-02-17"]
[null,null,"Next Generation Firewalls","Palo Alto",null,null,null,"IO","2015-03-31"]
[null,null,"Web Applications Firewall","Cloud Flare",null,null,null,"ICM","2014-05-29"]
[null,null,"Desktop Encryption","Bitlocker",null,null,null,"OSAM","2015-12-28"]
[null,null,"Multi Factor Authentication","Azure",null,null,null,"Accela","2015-12-04"]
[null,null,"Anti Virus Desktops","Forefront",null,null,null,"Hyland","2014-02-03"]
{"$rows_left_out":46}
{"sheet":"Section Titles","index":11,"n_rows":10,"n_cols":2,"rows_kept":10,"cut":false,"hidden":true,"merged":[]}
[null,"Meeting Pre-Work"]
[null,"Pre-PIJ/Assessment"]
[null,"Process"]
[null,"Project"]
[null,"Schedule"]
[null,"Dependencies"]
[null,"User Impact"]
[null,"Budget"]
[null,"Technology"]
[null,"Security"]
{"$rows_left_out":1}
{"sheet":"Popups","index":12,"n_rows":10,"n_cols":2,"rows_kept":10,"cut":false,"hidden":true,"merged":[[0,0,2,6]]}
["Popup/Disclaimers for Full PIJ"]
[]
[]
["Popup/Disclaimer Number","Popup/Disclaimer Notification"]
[1,"Please provide a copy under separate cover before the meeting."]
[2,"Be prepared to discuss in the meeting how the RFP SOW will be completed."]
[3,"While previously entered information is still available, please adjust as necessary based upon the RFP results."]
[4,"This project may qualify for the PIJ-EZ - if you would like to try the PIJ-EZ form instead, please exit through the main menu and go to the \"PIJ-EZ Assessment Form\" tab."]
[5,"Please provide a copy of the project plan under separate cover before the meeting."]
[6,"Based upon the given information, please complete the PIJ Financials section before the meeting."]
{"$rows_left_out":1}
{"sheet":"Invite Checklist Help Popups","index":13,"n_rows":11,"n_cols":3,"rows_kept":11,"cut":false,"hidden":true,"merged":[]}
["Invite List Title","Prompt","Title"]
["Agency Project Sponsor","The Project Sponsor is required for all projects.","Project Sponsor"]
["Agency Chief Information Officer (CIO) (or designee)","The Agency CIO (or designee) is required for all projects.  If there is no designated CIO, the person fulfilling the CIO role should be invited.","Project CIO (or designee)"]
["Agency Information Security Officer (ISO) (or designee)","The Agency ISO (or designee) is required for all projects.  If there is no designated ISO, the person fulfilling the CIO role should be invited.","Project ISO (or designee)"]
["Joint Legislative Budget Committee (JLBC) representative","A representative from JLBC is required for any project that will utilize a legislative funding source.  ","JLBC Representative"]
["Office of Strategic Planning & Budgeting (OSPB) representative","A representative from OSPB is required for any project that has been or will be submitted to the Governor’s Office as part of a Budget Decision Package.  ","OSPB Representative"]
["ADOA-ASET Strategic Program Manager","The Strategic Program Manager assigned to your Agency is required for all projects. If unsure who that may be, please email Strategic_Oversight@azdoa.gov and someone will contact you regarding the project.","ASET Strategic Program Manager"]
["ADOA-ASET Security, Privacy & Risk (ASET-SPR) representative","A representative from ASET-SPR is required for any project or proposed solution that involves the following:\n\n-Specific security-related items, e.g., a firewall appliance\n\n-Migrating, transmitting, or storing any data outside of the Agency’s or the State Data Center\n\n-PII, PHI, or other Protected Information as defined in the 8110 Statewide Data Classification Policy","ASET-SPR Representative"]
["Agency CPO or State Procurement Office (SPO) representative","The Chief Procurement Officer (CPO) for the Agency is to be invited to the meeting, unless not applicable for this project, or the Agency does not have a dedicated CPO, in which case this can remain blank.","Agency CPO/SPO Representative"]
["Agency CFO or Finance representative (if different from CPO)","The Chief Financial Officer (CFO) for the Agency, or the designated representative responsible for funding and financial reporting for the Agency, is to be invited to the meeting, if different from the CPO.","Agency CFO/Finance Representative"]
{"$rows_left_out":2}
{"sheet":"Question Type Decoder","index":14,"n_rows":12,"n_cols":2,"rows_kept":12,"cut":false,"hidden":true,"merged":[]}
["B","Blank (Question and forward/reverse)"]
["C","CheckBoxes"]
["F","FreeText"]
["D","Start/Finish Dates"]
["V","Cost Entry"]
["M","Major Milestones List"]
["PM","Project Methodolgy"]
["IH","In House Hosted"]
["VH","Vendor Hosted"]
["ES","Enterprise Solutions"]
{"$rows_left_out":3}
{"sheet":"Tracking Data","index":15,"n_rows":13,"n_cols":2,"rows_kept":13,"cut":false,"hidden":true,"merged":[]}
[]
[]
["Agency Name",{"$f":"'Project Request Form'!C9","v":0}]
[]
["Agency Acronym",{"$f":"VLOOKUP('Tracking Data'!B3,'Agency Names and Info'!A:B,2,FALSE)","v":{"$error":"#N/A"}}]
[]
["Date of BU Request"]
[]
["Name if ASET assisted"]
[]
{"$rows_left_out":4}
{"sheet":"Agency Names and Info","index":16,"n_rows":103,"n_cols":2,"rows_kept":103,"cut":false,"hidden":true,"merged":[]}
["Agency Name","Agency Code"]
["[-Please Select Agency-]","XX"]
["Accountancy Board","AB"]
["Acupuncture Examiners Board","AN"]
["Administration Department","AD"]
["Agricultural Employment Relations Board","AR"]
["Agriculture Department","AH"]
["Appraisal Board","AP"]
["Arizona Exposition and State Fair","CL"]
["Arizona Health Care Cost Containment System","HC"]
{"$rows_left_out":94}
{"sheet":"For ADOA-ASET Use Only","index":17,"n_rows":44,"n_cols":10,"rows_kept":44,"cut":false,"hidden":false,"merged":[[43,15,44,18],[45,3,45,12],[47,3,47,12],[48,3,48,12],[49,3,49,12],[42,3,42,5],[43,3,44,12],[46,3,46,12],[1,1,2,12],[4,3,4,12],[5,3,5,12],[6,3,6,12],[7,3,7,12],[21,3,21,12],[8,3,8,12],[20,3,20,12],[9,3,9,12],[10,3,10,12],[11,3,11,12],[12,3,12,12],[13,3,13,12],[34,3,34,12],[35,3,35,12],[36,3,40,12],[41,3,41,5],[41,6,41,8],[41,9,41,10],[41,11,41,12],[33,3,33,12],[1,17,3,20],[22,3,26,12],[28,3,28,12],[30,3,31,12],[32,3,32,12],[14,3,14,12],[15,3,15,12],[16,3,16,12],[17,3,17,12],[18,3,18,12],[19,3,19,12]]}
[]
[null,"Official ADOA-ASET Use Only"]
[]
[]
[null,null,null,"Has the value of the IT project to the public and the State been identified?"]
[null,null,null,"Does the proposed solution address the stated problem or situation?"]
[null,null,null,"Has the budget unit demonstrated competency to carry out the project successfully?"]
[null,null,null,"Have all applicable questions in the PIJ been addressed?"]
[null,null,null,"Have the Areas of Impact associated with the project been identified?"]
[null,null,null,"Is sufficient sponsorship and support by budget unit leadership evidenced in the meeting?"]
{"$rows_left_out":35}
{"sheet":"Version Notes","index":18,"n_rows":40,"n_cols":2,"rows_kept":40,"cut":false,"hidden":false,"merged":[]}
["Version","Notes"]
[1]
["●","Initial Launch"]
[]
[1.1000000000000001]
["●","Locked Financials Tab for areas which are auto calculated"]
["●","Locked Full PIJ Tab areas that should not be changed"]
["●","Changed the Final email from an auto send to a display box to allow for editing and additional emails to be added"]
["●","Fixed issue when accessing the \"View PIJ Sections\" button that the PIJ Sections starts half scrolled"]
["●","Workaround in place for issue where accessing PIJ Financials from the PIJ Sections Menu requiring user to click off financials tab then back in order to ender data correctly"]
{"$rows_left_out":31}
{"sheet":"Printable PIJ Version","index":19,"n_rows":21,"n_cols":12,"rows_kept":21,"cut":false,"hidden":false,"merged":[[18,6,18,10],[18,11,18,12],[19,7,19,9],[21,6,21,12],[17,6,17,10],[17,11,17,12],[20,6,20,12],[2,6,3,12],[6,6,6,12],[7,7,7,9],[9,6,9,12],[12,6,12,12],[11,6,11,12],[14,6,14,12],[13,7,13,9],[15,6,15,12],[16,7,16,9],[5,6,5,12],[8,6,8,12]]}
[]
[]
[null,null,null,null,null,null,"[- Please Enter the Project Title Here -]"]
[]
[]
[null,null,null,null,null,null,"Agency Requesting The Project:"]
[]
[]
[null,null,null,null,null,null,"Business Unit Requesting The Project:"]
[]
{"$rows_left_out":11}